{"text_format":"1","workbook":"xlsx","n_sheets":4,"sheets":["MENÜ","UNVANLAR","LİSTE","KİMLİK"],"not_rendered":{"charts":0,"images":4,"macros":1,"external_links":0,"defined_names":2,"comments":0,"pivot_tables":0},"unopened":[],"bounds":{"document_bytes":16777216,"sheet_cells":100000,"rows_first":2000,"rows_last":500,"rows_between":2000,"halvings":0,"cell_chars":16384,"cell_head_chars":4096},"cells_cut":0,"cells_raw":0,"read":"whole","date_system":"1900"}

{"sheet":"MENÜ","index":0,"n_rows":0,"n_cols":0,"rows_kept":0,"cut":false,"hidden":false,"merged":[]}

{"sheet":"UNVANLAR","index":1,"n_rows":10,"n_cols":1,"rows_kept":10,"cut":false,"hidden":false,"merged":[]}
["Müdür "]
["Müdür Yrd."]
["Öğretmen"]
["Usta Öğretici"]
["Usta Eğitici"]
["Psikolog"]
["Rehber Öğret."]
["Fizyoterapist"]
["Çocuk Gel.Uzm."]
["Memur"]

{"sheet":"LİSTE","index":2,"n_rows":8,"n_cols":19,"rows_kept":8,"cut":false,"hidden":false,"merged":[[0,0,0,1],[1,0,1,1],[2,0,2,1]]}
["İLİ                        :",null,"İzmir "]
["İLÇESİ                 :",null,"Gaziemir"]
["KURUM ADI         :"]
["S.N.","ADI","SOYADI","GÖREVİ","T.C KİMLİK NO","VERİLİŞ TARİHİ","İLİ/BELGE NO","VERİLİŞ TARİHİ","BELGE NO","DOĞUM YERİ ","DOĞUM TARİHİ","İLİ","İLÇESİ","BABA ADI","ANA ADI","KAN GRUBU","CİLT NO","AİLE SIRA NO","SIRA NO"]
[1]
[2]
[3]
[4]

{"sheet":"KİMLİK","index":3,"n_rows":30,"n_cols":22,"rows_kept":30,"cut":false,"hidden":false,"merged":[[13,12,14,15],[13,16,14,21],[14,7,14,10],[10,16,10,21],[10,7,10,10],[11,12,11,15],[11,16,11,21],[10,12,10,15],[3,1,6,10],[7,1,8,10],[9,4,9,6],[9,7,9,10],[7,16,7,21],[7,12,7,15],[9,16,9,21],[3,12,4,21],[5,12,5,15],[5,16,5,21],[6,12,6,15],[6,16,6,21],[8,12,8,15],[8,16,8,21],[9,12,9,15],[10,4,10,6],[14,4,14,6],[11,4,11,6],[11,7,11,10],[12,4,12,6],[12,7,12,10],[13,4,13,6],[13,7,13,10]]}
[null,null,null,null,null,null,null,null,null,null,null,null,null,1]
[]
[]
[null,null,null,null,null,null,null,null,null,null,null,null,"NÜFUS KAYIT ÖRNEĞİ"]
[]
[null,null,null,null,null,null,null,null,null,null,null,null,"  DOĞUM YERİ VE ",null,null,null,{"$f":"LOOKUP($N$1,LİSTE!A5:A57,LİSTE!J5:J57)","v":0}]
[null,null,null,null,null,null,null,null,null,null,null,null," TARİHİ",null,null,null,{"$f":"LOOKUP($N$1,LİSTE!A5:A57,LİSTE!K5:K57)","v":"00:00:00"}]
[null,{"$f":"LİSTE!C3","v":0},null,null,null,null,null,null,null,null,null,null,"  İLİ",null,null,null,{"$f":"LOOKUP($N$1,LİSTE!A5:A57,LİSTE!L5:L57)","v":0}]
[null,null,null,null,null,null,null,null,null,null,null,null,"  İLÇESİ",null,null,null,{"$f":"LOOKUP($N$1,LİSTE!A5:A57,LİSTE!M5:M57)","v":0}]
[null,null,null,null," ADI                     ",null,null,{"$f":"LOOKUP($N$1,LİSTE!A5:A57,LİSTE!B5:B57)","v":0},null,null,null,null,"  BABA ADI",null,null,null,{"$f":"LOOKUP($N$1,LİSTE!A5:A57,LİSTE!N5:N57)","v":0}]
[null,null,null,null," SOYADI            ",null,null,{"$f":"LOOKUP($N$1,LİSTE!A5:A57,LİSTE!C5:C57)","v":0},null,null,null,null,"  ANA ADI",null,null,null,{"$f":"LOOKUP($N$1,LİSTE!A5:A57,LİSTE!O5:O57)","v":0}]
[null,null,null,null," GÖREVİ              ",null,null,{"$f":"LOOKUP($N$1,LİSTE!A5:A57,LİSTE!D5:D57)","v":0},null,null,null,null,"  KAN GRUBU",null,null,null,{"$f":"LOOKUP($N$1,LİSTE!A5:A57,LİSTE!P5:P57)","v":0}]
[null,null,null,null," T.C. KİMLİK NO    ",null,null,{"$f":"LOOKUP($N$1,LİSTE!A5:A57,LİSTE!E5:E57)","v":0},null,null,null,null,"  CİLT NO ",null,{"$f":"LOOKUP($N$1,LİSTE!A5:A57,LİSTE!Q5:Q57)","v":0}," AİLE SIRA NO",null,null,{"$f":"LOOKUP($N$1,LİSTE!A5:A57,LİSTE!R5:R57)","v":0},"SIRA NO ",null,{"$f":"LOOKUP($N$1,LİSTE!A5:A57,LİSTE!S5:S57)","v":0}]
[null,null,null,null," VERİLİŞ TARİHİ   ",null,null,{"$f":"LOOKUP($N$1,LİSTE!A5:A57,LİSTE!H5:H57)","v":"00:00:00"},null,null,null,null,"İMZA"]
[null,null,null,null," İLİ / BELGE NO    ",null,null,{"$f":"CONCATENATE(LİSTE!C1,\"-\",LOOKUP($N$1,LİSTE!A5:A57,LİSTE!I5:I57))","v":"İzmir -"}]
[]
[]
[]
[]
[]
[]
[]
[]
[null,null,null,null,null,null,null,null," "]
[null,null,null,null,null," "]
[]
[]
[]
[null,null,null,null,null,null,null,null,null,null,"Renkli çıktı aldıktan sonra "]
[null,null,null,null,null,null,null,null,null,null,"buradan  dışa katlayınız ve dış kenarları kesiniz…"]